Reaction Details
TargetStreptokinase A
LigandBDBM50625
Substrate/Competitorn/a
Meas. Tech.Absorbance Microorganism-Based Dose Response HTS to Identify Inhibitors of Streptokinase Expression
EC50 50000±n/a nM
Citation PubChem, PC Absorbance Microorganism-Based Dose Response HTS to Identify Inhibitors of Streptokinase Expression PubChem Bioassay(2009)[AID]
 
Streptokinase A
Name:Streptokinase A
Type:Enzyme Catalytic Domain
Mol. Mass.:49924.80
Organism:Streptococcus pyogenes M1 GAS
Description:gi_15675770
Residue:440
BDBM50625
NameBDBM50625
Synonyms:(E)-4-(1,3-benzothiazol-2-yl)-5-[3-(p-anisoylamino)phenyl]pent-4-enoic acid (E)-4-(1,3-benzothiazol-2-yl)-5-[3-[(4-methoxyphenyl)carbonylamino]phenyl]pent-4-enoic acid MLS000775463 cid_6224181
TypeSmall organic molecule
Emp. Form.C26H22N2O4S
Mol. Mass.458.529
SMILESCOc1ccc(cc1)C(=O)Nc1cccc(\C=C(/CCC(O)=O)c2nc3ccccc3s2)c1