Reaction Details
TargetStreptokinase A
LigandBDBM58081
Substrate/Competitorn/a
Meas. Tech.Absorbance Microorganism-Based Dose Response HTS to Identify Inhibitors of Streptokinase Expression
EC50 150000±n/a nM
Citation PubChem, PC Absorbance Microorganism-Based Dose Response HTS to Identify Inhibitors of Streptokinase Expression PubChem Bioassay(2009)[AID]
 
Streptokinase A
Name:Streptokinase A
Type:Enzyme Catalytic Domain
Mol. Mass.:49924.80
Organism:Streptococcus pyogenes M1 GAS
Description:gi_15675770
Residue:440
BDBM58081
NameBDBM58081
Synonyms:4-(4-Methoxy-phenoxy)-2-pyridin-2-yl-quinazoline 4-(4-methoxyphenoxy)-2-(2-pyridyl)quinazoline 4-(4-methoxyphenoxy)-2-pyridin-2-ylquinazoline SMR000434264 | cid_929911
TypeSmall organic molecule
Emp. Form.C20H15N3O2
Mol. Mass.329.352
SMILESCOc1ccc(Oc2nc(nc3ccccc23)-c2ccccn2)cc1