Reaction Details
TargetStreptokinase A
LigandBDBM58083
Substrate/Competitorn/a
Meas. Tech.Absorbance Microorganism-Based Dose Response HTS to Identify Inhibitors of Streptokinase Expression
EC50 5671±n/a nM
Citation PubChem, PC Absorbance Microorganism-Based Dose Response HTS to Identify Inhibitors of Streptokinase Expression PubChem Bioassay(2009)[AID]
 
Streptokinase A
Name:Streptokinase A
Type:Enzyme Catalytic Domain
Mol. Mass.:49924.80
Organism:Streptococcus pyogenes M1 GAS
Description:gi_15675770
Residue:440
BDBM58083
NameBDBM58083
Synonyms:4-[(Diisobutylamino)-methyl]-6,7,8,9-tetrahydro-benzo[g]chromen-2-one 4-[[bis(2-methylpropyl)amino]methyl]-6,7,8,9-tetrahydrobenzo[g][1]benzopyran-2-one MLS000763058 cid_1845204
TypeSmall organic molecule
Emp. Form.C22H31NO2
Mol. Mass.341.487
SMILESCC(C)CN(CC(C)C)Cc1cc(=O)oc2cc3CCCCc3cc12