Reaction Details
TargetStreptokinase A
LigandBDBM58084
Substrate/Competitorn/a
Meas. Tech.Absorbance Microorganism-Based Dose Response HTS to Identify Inhibitors of Streptokinase Expression
EC50 150000±n/a nM
Citation PubChem, PC Absorbance Microorganism-Based Dose Response HTS to Identify Inhibitors of Streptokinase Expression PubChem Bioassay(2009)[AID]
 
Streptokinase A
Name:Streptokinase A
Type:Enzyme Catalytic Domain
Mol. Mass.:49924.80
Organism:Streptococcus pyogenes M1 GAS
Description:gi_15675770
Residue:440
BDBM58084
NameBDBM58084
Synonyms:(5E)-1-allyl-5-[1-[4-(dimethylamino)anilino]propylidene]barbituric acid (5E)-5-[1-[[4-(dimethylamino)phenyl]amino]propylidene]-1-prop-2-enyl-1,3-diazinane-2,4,6-trione MLS000559834 cid_6141365
TypeSmall organic molecule
Emp. Form.C18H22N4O3
Mol. Mass.342.3923
SMILESCCC(Nc1ccc(cc1)N(C)C)=C1C(=O)NC(=O)N(CC=C)C1=O