Reaction Details
TargetStreptokinase A
LigandBDBM58092
Substrate/Competitorn/a
Meas. Tech.Absorbance Microorganism-Based Dose Response HTS to Identify Inhibitors of Streptokinase Expression
EC50 150000±n/a nM
Citation PubChem, PC Absorbance Microorganism-Based Dose Response HTS to Identify Inhibitors of Streptokinase Expression PubChem Bioassay(2009)[AID]
 
Streptokinase A
Name:Streptokinase A
Type:Enzyme Catalytic Domain
Mol. Mass.:49924.80
Organism:Streptococcus pyogenes M1 GAS
Description:gi_15675770
Residue:440
BDBM58092
NameBDBM58092
Synonyms:2-acetamido-2-dodecylpropanedioic acid diethyl ester MLS000737872 cid_227967 diethyl 2-acetamido-2-dodecylpropanedioate
TypeSmall organic molecule
Emp. Form.C21H39NO5
Mol. Mass.385.5381
SMILESCCCCCCCCCCCCC(NC(C)=O)(C(=O)OCC)C(=O)OCC