Reaction Details
TargetStreptokinase A
LigandBDBM58094
Substrate/Competitorn/a
Meas. Tech.Absorbance Microorganism-Based Dose Response HTS to Identify Inhibitors of Streptokinase Expression
EC50 150000±n/a nM
Citation PubChem, PC Absorbance Microorganism-Based Dose Response HTS to Identify Inhibitors of Streptokinase Expression PubChem Bioassay(2009)[AID]
 
Streptokinase A
Name:Streptokinase A
Type:Enzyme Catalytic Domain
Mol. Mass.:49924.80
Organism:Streptococcus pyogenes M1 GAS
Description:gi_15675770
Residue:440
BDBM58094
NameBDBM58094
Synonyms:9-phenylcarbazole SMR000446051 | cid_70851
TypeSmall organic molecule
Emp. Form.C18H13N
Mol. Mass.243.3025
SMILESc1ccc(cc1)-n1c2ccccc2c2ccccc12