Reaction Details
TargetLarge T antigen
LigandBDBM40577
Substrate/Competitorn/a
Meas. Tech.Identification of SV40 T antigen inhibitors: Cytotoxicity screen of selected hits
EC50 30700±n/a nM
Citation PubChem, PC Identification of SV40 T antigen inhibitors: Cytotoxicity screen of selected hits PubChem Bioassay(2009)[AID]
 
Large T antigen
Name:Large T antigen
Type:Enzyme Catalytic Domain
Mol. Mass.:81575.54
Organism:Simian virus 40
Description:P03070
Residue:708
BDBM40577
NameBDBM40577
Synonyms:4-(4-Pyrrolidin-1-yl-quinazolin-2-ylamino)-phenol 4-[(4-pyrrolidinoquinazolin-2-yl)amino]phenol;hydrochloride MLS000026828 cid_6602552
TypeSmall organic molecule
Emp. Form.C18H18N4O
Mol. Mass.306.3617
SMILESOc1ccc(Nc2nc(N3CCCC3)c3ccccc3n2)cc1