Reaction Details
TargetBifunctional dihydrofolate reductase-thymidylate synthase
LigandBDBM18769
Substrate/Competitorn/a
Meas. Tech.Inhibition Assay
pH7±0
Temperature293.15±0 K
Ki>1.775e+6±n/a nM
Citation Ferrari, SCosti, PMWade, RC Inhibitor specificity via protein dynamics: insights from the design of antibacterial agents targeted against thymidylate synthase. Chem Biol10:1183-93 (2003) 
 
Bifunctional dihydrofolate reductase-thymidylate synthase
Name:Bifunctional dihydrofolate reductase-thymidylate synthase
Type:Protein
Mol. Mass.:58691.04
Organism:Leishmania major
Description:P07382
Residue:520
BDBM18769
NameBDBM18769
Synonyms:1,8-naphthalein derivative, 17 CHEMBL303171 | Phenolnaphthalein derivative, 1
TypeSmall organic molecule
Emp. Form.C24H14F2O4
Mol. Mass.404.3624
SMILESOc1ccc(cc1F)C1(OC(=O)c2cccc3cccc1c23)c1ccc(O)c(F)c1