Reaction Details
TargetThymidylate synthase
LigandBDBM18770
Substrate/Competitorn/a
Meas. Tech.Inhibition Assay
pH7±0
Temperature293.15±0 K
Ki 2.2e+4±n/a nM
Citation Ferrari, SCosti, PMWade, RC Inhibitor specificity via protein dynamics: insights from the design of antibacterial agents targeted against thymidylate synthase. Chem Biol10:1183-93 (2003) 
 
Thymidylate synthase
Name:Thymidylate synthase
Type:Enzyme
Mol. Mass.:34362.44
Organism:Pneumocystis carinii
Description:n/a
Residue:297
BDBM18770
NameBDBM18770
Synonyms:1,8-naphthalein derivative, 18 Phenolnaphthalein derivative, 3
TypeSmall organic molecule
Emp. Form.C24H13ClF2O4
Mol. Mass.438.807
SMILESOc1ccc(cc1F)C1(OC(=O)c2cccc3c(Cl)ccc1c23)c1ccc(O)c(F)c1