Reaction Details
TargetG1/S-specific cyclin-D1
LigandBDBM59093
Substrate/Competitorn/a
Meas. Tech.Kinase Inhibition Assay
IC50 8.9e+2±n/a nM
Citation McInnes, CWang, SAnderson, SO'Boyle, JJackson, WKontopidis, GMeades, CMezna, MThomas, MWood, GLane, DPFischer, PM Structural determinants of CDK4 inhibition and design of selective ATP competitive inhibitors. Chem Biol11:525-34 (2004) 
 
G1/S-specific cyclin-D1
Name:G1/S-specific cyclin-D1
Type:Enzyme Subunit
Mol. Mass.:33717.70
Organism:Homo sapiens (Human)
Description:n/a
Residue:295
BDBM59093
NameBDBM59093
Synonyms:Aminopyrimidine, 3
TypeSmall organic molecule
Emp. Form.C18H20N6OS
Mol. Mass.368.456
SMILESCNc1nc(C)c(s1)-c1ccnc(Nc2cccc(CNC(C)=O)c2)n1