Reaction Details
TargetG1/S-specific cyclin-E1
LigandBDBM50319624
Substrate/Competitorn/a
Meas. Tech.Kinase Inhibition Assay
IC50 2.3e+2±n/a nM
Citation McInnes, CWang, SAnderson, SO'Boyle, JJackson, WKontopidis, GMeades, CMezna, MThomas, MWood, GLane, DPFischer, PM Structural determinants of CDK4 inhibition and design of selective ATP competitive inhibitors. Chem Biol11:525-34 (2004) 
 
G1/S-specific cyclin-E1
Name:G1/S-specific cyclin-E1
Type:Enzyme Subunit
Mol. Mass.:47073.17
Organism:Homo sapiens (Human)
Description:n/a
Residue:410
BDBM50319624
NameBDBM50319624
Synonyms:Aminopyrimidine, 4 N1-(4-(2,4-Dimethylthiazol-5-yl)pyrimidin-2-yl)benzene-1,4-diamine
TypeSmall organic molecule
Emp. Form.C15H15N5S
Mol. Mass.297.378
SMILESCc1nc(C)c(s1)-c1ccnc(Nc2ccc(N)cc2)n1