Reaction Details
TargetG1/S-specific cyclin-E1
LigandBDBM50319619
Substrate/Competitorn/a
Meas. Tech.Kinase Inhibition Assay
IC50 2.0e+3±n/a nM
Citation McInnes, CWang, SAnderson, SO'Boyle, JJackson, WKontopidis, GMeades, CMezna, MThomas, MWood, GLane, DPFischer, PM Structural determinants of CDK4 inhibition and design of selective ATP competitive inhibitors. Chem Biol11:525-34 (2004) 
 
G1/S-specific cyclin-E1
Name:G1/S-specific cyclin-E1
Type:Enzyme Subunit
Mol. Mass.:47073.17
Organism:Homo sapiens (Human)
Description:n/a
Residue:410
BDBM50319619
NameBDBM50319619
Synonyms:4-(2,4-Dimethylthiazol-5-yl)-N-(4-morpholinophenyl)pyrimidin-2-amine CHEMBL1085626
TypeSmall organic molecule
Emp. Form.C19H21N5OS
Mol. Mass.367.468
SMILESCc1nc(C)c(s1)-c1ccnc(Nc2ccc(cc2)N2CCOCC2)n1