Reaction Details
TargetG1/S-specific cyclin-E1
LigandBDBM59097
Substrate/Competitorn/a
Meas. Tech.Kinase Inhibition Assay
IC50 2.2e+2±n/a nM
Citation McInnes, CWang, SAnderson, SO'Boyle, JJackson, WKontopidis, GMeades, CMezna, MThomas, MWood, GLane, DPFischer, PM Structural determinants of CDK4 inhibition and design of selective ATP competitive inhibitors. Chem Biol11:525-34 (2004) 
 
G1/S-specific cyclin-E1
Name:G1/S-specific cyclin-E1
Type:Enzyme Subunit
Mol. Mass.:47073.17
Organism:Homo sapiens (Human)
Description:n/a
Residue:410
BDBM59097
NameBDBM59097
Synonyms:Aminopyrimidine, 10
TypeSmall organic molecule
Emp. Form.C19H23N7S
Mol. Mass.381.498
SMILESCNc1nc(C)c(s1)-c1ccnc(Nc2ccc(cc2)N2CCNCC2)n1