Reaction Details
TargetQuinone-dependent D-lactate dehydrogenase
LigandBDBM59099
Substrate/Competitorn/a
Meas. Tech.Steady-State Inhibition Assay
pH7.4±0
Ki 42±0.0 nM
Citation Sem, DSBertolaet, BBaker, BChang, ECostache, ADCoutts, SDong, QHansen, MHong, VHuang, XJack, RMKho, RLang, HMa, CTMeininger, DPellecchia, MPierre, FVillar, HYu, L Systems-based design of bi-ligand inhibitors of oxidoreductases: filling the chemical proteomic toolbox. Chem Biol11:185-94 (2004) 
 
Quinone-dependent D-lactate dehydrogenase
Name:Quinone-dependent D-lactate dehydrogenase
Type:Enzyme
Mol. Mass.:64613.58
Organism:Escherichia coli
Description:P06149
Residue:571
BDBM59099
NameBDBM59099
Synonyms:Bi-ligand, 2
TypeSmall organic molecule
Emp. Form.C22H20Cl2N2O4S2
Mol. Mass.511.441
SMILESOc1ccc(\C=C2/SC(=S)N(CCCCC(=O)NCc3ccc(Cl)c(Cl)c3)C2=O)cc1O