Reaction Details
TargetQuinone-dependent D-lactate dehydrogenase
LigandBDBM59100
Substrate/Competitorn/a
Meas. Tech.Steady-State Inhibition Assay
pH7.4±0
Ki 1.2e+4±n/a nM
Citation Sem, DSBertolaet, BBaker, BChang, ECostache, ADCoutts, SDong, QHansen, MHong, VHuang, XJack, RMKho, RLang, HMa, CTMeininger, DPellecchia, MPierre, FVillar, HYu, L Systems-based design of bi-ligand inhibitors of oxidoreductases: filling the chemical proteomic toolbox. Chem Biol11:185-94 (2004) 
 
Quinone-dependent D-lactate dehydrogenase
Name:Quinone-dependent D-lactate dehydrogenase
Type:Enzyme
Mol. Mass.:64613.58
Organism:Escherichia coli
Description:P06149
Residue:571
BDBM59100
NameBDBM59100
Synonyms:Bi-ligand, 3
TypeSmall organic molecule
Emp. Form.C25H20N2O5S2
Mol. Mass.492.567
SMILESCc1ccc(Oc2ccc(NC(=O)CN3C(=S)S\C(=C/c4ccc(O)c(O)c4)C3=O)cc2)cc1