Reaction Details
TargetCyclin-dependent kinase 5 activator 1
LigandBDBM59102
Substrate/Competitorn/a
Meas. Tech.In Vitro Kinase Assay
pH7.2±0
IC50 79±0 nM
Citation Wan, YHur, WCho, CYLiu, YAdrian, FJLozach, OBach, SMayer, TFabbro, DMeijer, LGray, NS Synthesis and target identification of hymenialdisine analogs. Chem Biol11:247-59 (2004) 
 
Cyclin-dependent kinase 5 activator 1
Name:Cyclin-dependent kinase 5 activator 1
Type:Enzyme Subunit
Mol. Mass.:34077.43
Organism:Homo sapiens (Human)
Description:Q15078
Residue:307
BDBM59102
NameBDBM59102
Synonyms:Hymenialdisine, 9
TypeSmall organic molecule
Emp. Form.C11H10BrN5O2
Mol. Mass.324.133
SMILESNC1=NC(=O)C(N1)=C1CCNC(=O)c2[nH]cc(Br)c12