Reaction Details
TargetCyclin-dependent kinase 5 activator 1
LigandBDBM59116
Substrate/Competitorn/a
Meas. Tech.In Vitro Kinase Assay
pH7.2±0
IC50 5110±0 nM
Citation Wan, YHur, WCho, CYLiu, YAdrian, FJLozach, OBach, SMayer, TFabbro, DMeijer, LGray, NS Synthesis and target identification of hymenialdisine analogs. Chem Biol11:247-59 (2004) 
 
Cyclin-dependent kinase 5 activator 1
Name:Cyclin-dependent kinase 5 activator 1
Type:Enzyme Subunit
Mol. Mass.:34077.43
Organism:Homo sapiens (Human)
Description:Q15078
Residue:307
BDBM59116
NameBDBM59116
Synonyms:Hymenialdisine, 27k
TypeSmall organic molecule
Emp. Form.C17H14BrN5O3
Mol. Mass.416.229
SMILESCC(=O)NC1=NC(=O)C(N1)=C1CCNC(=O)c2[nH]c3ccc(Br)cc3c12