Reaction Details
TargetCyclin-dependent kinase 5 activator 1
LigandBDBM59117
Substrate/Competitorn/a
Meas. Tech.In Vitro Kinase Assay
pH7.2±0
IC50 8.15e+3±n/a nM
Citation Wan, YHur, WCho, CYLiu, YAdrian, FJLozach, OBach, SMayer, TFabbro, DMeijer, LGray, NS Synthesis and target identification of hymenialdisine analogs. Chem Biol11:247-59 (2004) 
 
Cyclin-dependent kinase 5 activator 1
Name:Cyclin-dependent kinase 5 activator 1
Type:Enzyme Subunit
Mol. Mass.:34077.43
Organism:Homo sapiens (Human)
Description:Q15078
Residue:307
BDBM59117
NameBDBM59117
Synonyms:CHEMBL151430 | Hymenialdisine, 11b
TypeSmall organic molecule
Emp. Form.C11H11Br2N5O
Mol. Mass.389.046
SMILESNc1ncc([nH]1)C1CCNC(=O)c2[nH]c(Br)c(Br)c12