Reaction Details
TargetCyclin-dependent kinase 5 activator 1
LigandBDBM59131
Substrate/Competitorn/a
Meas. Tech.In Vitro Kinase Assay
pH7.2±0
IC50 125±n/a nM
Citation Wan, YHur, WCho, CYLiu, YAdrian, FJLozach, OBach, SMayer, TFabbro, DMeijer, LGray, NS Synthesis and target identification of hymenialdisine analogs. Chem Biol11:247-59 (2004) 
 
Cyclin-dependent kinase 5 activator 1
Name:Cyclin-dependent kinase 5 activator 1
Type:Enzyme Subunit
Mol. Mass.:34077.43
Organism:Homo sapiens (Human)
Description:Q15078
Residue:307
BDBM59131
NameBDBM59131
Synonyms:Hymenialdisine, 28g
TypeSmall organic molecule
Emp. Form.C17H14ClN5O
Mol. Mass.339.779
SMILESClc1ccc2[nH]c3c(C(CCNC3=O)=NNc3ccccn3)c2c1