Reaction Details
TargetCyclin-dependent kinase 5 activator 1
LigandBDBM59135
Substrate/Competitorn/a
Meas. Tech.In Vitro Kinase Assay
pH7.2±0
IC50 869±n/a nM
Citation Wan, YHur, WCho, CYLiu, YAdrian, FJLozach, OBach, SMayer, TFabbro, DMeijer, LGray, NS Synthesis and target identification of hymenialdisine analogs. Chem Biol11:247-59 (2004) 
 
Cyclin-dependent kinase 5 activator 1
Name:Cyclin-dependent kinase 5 activator 1
Type:Enzyme Subunit
Mol. Mass.:34077.43
Organism:Homo sapiens (Human)
Description:Q15078
Residue:307
BDBM59135
NameBDBM59135
Synonyms:Hymenialdisine, 28ag
TypeSmall organic molecule
Emp. Form.C18H13ClF3N5O
Mol. Mass.407.777
SMILESFC(F)(F)c1ccc(NN=C2CCNC(=O)c3[nH]c4ccc(Cl)cc4c23)nc1