Reaction Details
TargetCoagulation factor VIII
LigandBDBM59154
Substrate/Competitorn/a
Meas. Tech.Inhibition Assay
Temperature310.15±0 K
IC50 4.63e+3± 7e+2 nM
Citation Spiegel, PCKaiser, SMSimon, JAStoddard, BL Disruption of protein-membrane binding and identification of small-molecule inhibitors of coagulation factor VIII. Chem Biol11:1413-22 (2004) 
 
Coagulation factor VIII
Name:Coagulation factor VIII
Type:Protein
Mol. Mass.:267036.98
Organism:Homo sapiens (Human)
Description:P00451
Residue:2351
BDBM59154
NameBDBM59154
Synonyms:5739991
TypeSmall organic molecule
Emp. Form.C14H7BrN2O4S2
Mol. Mass.411.25
SMILES[O-][N+](=O)c1ccc(cc1)N1C(=S)S\C(=C/c2ccc(Br)o2)C1=O