Reaction Details
TargetCoagulation factor VIII
LigandBDBM59161
Substrate/Competitorn/a
Meas. Tech.Inhibition Assay
Temperature310.15±0 K
IC50 5.65e+3± 1.10e+3 nM
Citation Spiegel, PCKaiser, SMSimon, JAStoddard, BL Disruption of protein-membrane binding and identification of small-molecule inhibitors of coagulation factor VIII. Chem Biol11:1413-22 (2004) 
 
Coagulation factor VIII
Name:Coagulation factor VIII
Type:Protein
Mol. Mass.:267036.98
Organism:Homo sapiens (Human)
Description:P00451
Residue:2351
BDBM59161
NameBDBM59161
Synonyms:5738875
TypeSmall organic molecule
Emp. Form.C15H7F3INO2S2
Mol. Mass.481.251
SMILESFC(F)(F)c1cccc(c1)N1C(=S)S\C(=C/c2ccc(I)o2)C1=O