Reaction Details
TargetCoagulation factor VIII
LigandBDBM59162
Substrate/Competitorn/a
Meas. Tech.Inhibition Assay
pH8±0
IC50 2.56e+3± 4.5e+2 nM
Citation Spiegel, PCKaiser, SMSimon, JAStoddard, BL Disruption of protein-membrane binding and identification of small-molecule inhibitors of coagulation factor VIII. Chem Biol11:1413-22 (2004) 
 
Coagulation factor VIII
Name:Coagulation factor VIII
Type:Protein
Mol. Mass.:267036.98
Organism:Homo sapiens (Human)
Description:P00451
Residue:2351
BDBM59162
NameBDBM59162
Synonyms:8047577
TypeSmall organic molecule
Emp. Form.C21H10Cl2F3NO2S2
Mol. Mass.500.341
SMILESFC(F)(F)c1cccc(c1)N1C(=S)S\C(=C/c2ccc(o2)-c2ccc(Cl)cc2Cl)C1=O