Reaction Details
TargetCoagulation factor VIII
LigandBDBM59159
Substrate/Competitorn/a
Meas. Tech.Inhibition Assay
pH8±0
IC50 2.11e+3± 3.1e+2 nM
Citation Spiegel, PCKaiser, SMSimon, JAStoddard, BL Disruption of protein-membrane binding and identification of small-molecule inhibitors of coagulation factor VIII. Chem Biol11:1413-22 (2004) 
 
Coagulation factor VIII
Name:Coagulation factor VIII
Type:Protein
Mol. Mass.:267036.98
Organism:Homo sapiens (Human)
Description:P00451
Residue:2351
BDBM59159
NameBDBM59159
Synonyms:6190013
TypeSmall organic molecule
Emp. Form.C15H7Cl2N3O5S
Mol. Mass.412.204
SMILES[#8-]-[#7+](=O)-c1cc(Cl)c(cc1Cl)-c1ccc(\[#6]=[#6]-2/[#6](=O)-[#7]-[#6](=S)-[#7]-[#6]-2=O)o1