Reaction Details
TargetCoagulation factor VIII
LigandBDBM59165
Substrate/Competitorn/a
Meas. Tech.Inhibition Assay
pH8±0
IC50 6.51e+3± 8.5e+2 nM
Citation Spiegel, PCKaiser, SMSimon, JAStoddard, BL Disruption of protein-membrane binding and identification of small-molecule inhibitors of coagulation factor VIII. Chem Biol11:1413-22 (2004) 
 
Coagulation factor VIII
Name:Coagulation factor VIII
Type:Protein
Mol. Mass.:267036.98
Organism:Homo sapiens (Human)
Description:P00451
Residue:2351
BDBM59165
NameBDBM59165
Synonyms:8056354
TypeSmall organic molecule
Emp. Form.C16H8ClN2O5S
Mol. Mass.375.764
SMILES[#8-]-[#6](=O)-c1cccc(-c2ccc(\[#6]=[#6]-3/[#6](=O)-[#7]-[#6](=S)-[#7]-[#6]-3=O)o2)c1Cl