Reaction Details
TargetCoagulation factor VIII
LigandBDBM59163
Substrate/Competitorn/a
Meas. Tech.Inhibition Assay
pH7.9±0
IC50 5.6e+3±n/a nM
Citation Spiegel, PCKaiser, SMSimon, JAStoddard, BL Disruption of protein-membrane binding and identification of small-molecule inhibitors of coagulation factor VIII. Chem Biol11:1413-22 (2004) 
 
Coagulation factor VIII
Name:Coagulation factor VIII
Type:Protein
Mol. Mass.:267036.98
Organism:Homo sapiens (Human)
Description:P00451
Residue:2351
BDBM59163
NameBDBM59163
Synonyms:6789536
TypeSmall organic molecule
Emp. Form.C20H11ClN2O4S3
Mol. Mass.474.96
SMILES[O-][N+](=O)c1ccc(cc1)N1C(=S)S\C(=C\c2ccc(Sc3ccc(Cl)cc3)o2)C1=O