Reaction Details
TargetCyclin-dependent kinase 5
LigandBDBM59194
Substrate/Competitorn/a
Meas. Tech.In Vitro Kinase Assay of Tau Phosphorylation
Ki 6.6e+2±n/a nM
IC50 2.0e+3±n/a nM
Citation Ahn, JSRadhakrishnan, MLMapelli, MChoi, STidor, BCuny, GDMusacchio, AYeh, LAKosik, KS Defining Cdk5 ligand chemical space with small molecule inhibitors of tau phosphorylation. Chem Biol12:811-23 (2005) 
 
Cyclin-dependent kinase 5
Name:Cyclin-dependent kinase 5
Type:Enzyme Subunit
Mol. Mass.:33308.61
Organism:Homo sapiens (Human)
Description:n/a
Residue:292
BDBM59194
NameBDBM59194
Synonyms:4-aminothiazole, 2.0
TypeSmall organic molecule
Emp. Form.C16H11ClN4O3S
Mol. Mass.374.802
SMILESNc1nc(Nc2ccc(Cl)cc2)sc1C(=O)c1cccc(c1)N(=O)=O