Reaction Details
TargetAdenosine receptor A2a
LigandBDBM59206
Substrate/Competitorn/a
Meas. Tech.Binding Assay
pH7.4±0
Temperature298.15±0 K
Ki 2110±260 nM
Citation Jacobson, KAOhno, MDuong, HTKim, SKTchilibon, SCesnek, MHolý, AGao, ZG A neoceptor approach to unraveling microscopic interactions between the human A2A adenosine receptor and its agonists. Chem Biol12:237-47 (2005) 
 
Adenosine receptor A2a
Name:Adenosine receptor A2a
Type:G Protein-Coupled Receptor (GPCR)
Mol. Mass.:44716.46
Organism:Homo sapiens (Human)
Description:P29274
Residue:412
BDBM59206
NameBDBM59206
Synonyms:Adenosine analog, 11
TypeSmall organic molecule
Emp. Form.C12H16N6O5
Mol. Mass.324.2926
SMILESNc1ncnc2n(cnc12)[C@@H]1O[C@@H]([C@@H](O)[C@H]1O)C(=O)NCCO