Reaction Details
TargetAdenosine receptor A1
LigandBDBM59208
Substrate/Competitorn/a
Meas. Tech.Binding Assay
Ki 106±30 nM
Citation Jacobson, KAOhno, MDuong, HTKim, SKTchilibon, SCesnek, MHolý, AGao, ZG A neoceptor approach to unraveling microscopic interactions between the human A2A adenosine receptor and its agonists. Chem Biol12:237-47 (2005) 
 
Adenosine receptor A1
Name:Adenosine receptor A1
Type:G Protein-Coupled Receptor (GPCR)
Mol. Mass.:36520.92
Organism:Homo sapiens (Human)
Description:P30542
Residue:326
BDBM59208
NameBDBM59208
Synonyms:Adenosine analog, 13
TypeSmall organic molecule
Emp. Form.C20H24N6O4
Mol. Mass.412.4424
SMILESCCNC(=O)[C@H]1O[C@H]([C@H](O)[C@@H]1O)n1cnc2c(NCc3ccccc3C)ncnc12