Reaction Details
TargetAdenosine receptor A3
LigandBDBM50208817
Substrate/Competitorn/a
Meas. Tech.Binding Assay
Ki 5.1±1.3 nM
Citation Jacobson, KAOhno, MDuong, HTKim, SKTchilibon, SCesnek, MHolý, AGao, ZG A neoceptor approach to unraveling microscopic interactions between the human A2A adenosine receptor and its agonists. Chem Biol12:237-47 (2005) 
 
Adenosine receptor A3
Name:Adenosine receptor A3
Type:G Protein-Coupled Receptor (GPCR)
Mol. Mass.:36197.32
Organism:Homo sapiens (Human)
Description:P0DMS8
Residue:318
BDBM50208817
NameBDBM50208817
Synonyms:(2S,3S,4R,5R)-N-ethyl-5-(6-guanidino-9H-purin-9-yl)-3,4-dihydroxy-tetrahydrofuran-2-carboxamide CHEMBL376542
TypeSmall organic molecule
Emp. Form.C13H18N8O4
Mol. Mass.350.3332
SMILES[#6]-[#6]-[#7]-[#6](=O)-[#6@H]-1-[#8]-[#6@H](-[#6@H](-[#8])-[#6@@H]-1-[#8])-n1cnc2c(\[#7]=[#6](/[#7])-[#7])ncnc12