Reaction Details
TargetAdenosine receptor A3
LigandBDBM59207
Substrate/Competitorn/a
Meas. Tech.Binding Assay
Ki 394±74 nM
Citation Jacobson, KAOhno, MDuong, HTKim, SKTchilibon, SCesnek, MHolý, AGao, ZG A neoceptor approach to unraveling microscopic interactions between the human A2A adenosine receptor and its agonists. Chem Biol12:237-47 (2005) 
 
Adenosine receptor A3
Name:Adenosine receptor A3
Type:G Protein-Coupled Receptor (GPCR)
Mol. Mass.:36197.32
Organism:Homo sapiens (Human)
Description:P0DMS8
Residue:318
BDBM59207
NameBDBM59207
Synonyms:Adenosine analog, 12
TypeSmall organic molecule
Emp. Form.C18H21N7O4
Mol. Mass.399.4038
SMILESCc1ccccc1CNc1ncnc2n(cnc12)[C@@H]1O[C@@H]([C@@H](O)[C@H]1O)C(=O)NN