Reaction Details
TargetAdenosine receptor A3
LigandBDBM59208
Substrate/Competitorn/a
Meas. Tech.Binding Assay
Ki 78.8±25.5 nM
Citation Jacobson, KAOhno, MDuong, HTKim, SKTchilibon, SCesnek, MHolý, AGao, ZG A neoceptor approach to unraveling microscopic interactions between the human A2A adenosine receptor and its agonists. Chem Biol12:237-47 (2005) 
 
Adenosine receptor A3
Name:Adenosine receptor A3
Type:G Protein-Coupled Receptor (GPCR)
Mol. Mass.:36197.32
Organism:Homo sapiens (Human)
Description:P0DMS8
Residue:318
BDBM59208
NameBDBM59208
Synonyms:Adenosine analog, 13
TypeSmall organic molecule
Emp. Form.C20H24N6O4
Mol. Mass.412.4424
SMILESCCNC(=O)[C@H]1O[C@H]([C@H](O)[C@@H]1O)n1cnc2c(NCc3ccccc3C)ncnc12