Reaction Details
TargetCDK-activating kinase assembly factor MAT1
LigandBDBM59227
Substrate/Competitorn/a
Meas. Tech.In Vitro Kinase Assay
IC50 71±n/a nM
Citation Caligiuri, MBecker, FMurthi, KKaplan, FDedier, SKaufmann, CMachl, AZybarth, GRichard, JBockovich, NKluge, AKley, N A proteome-wide CDK/CRK-specific kinase inhibitor promotes tumor cell death in the absence of cell cycle progression. Chem Biol12:1103-15 (2005) 
 
CDK-activating kinase assembly factor MAT1
Name:CDK-activating kinase assembly factor MAT1
Type:Enzyme
Mol. Mass.:35820.03
Organism:Homo sapiens (Human)
Description:P51948
Residue:309
BDBM59227
NameBDBM59227
Synonyms:Pyrazolopyrimidone analog, RGB-286147
TypeSmall organic molecule
Emp. Form.C23H22Cl2N4O3
Mol. Mass.473.352
SMILESCC(C)c1nn(-c2c(Cl)cccc2Cl)c2nc(Cc3ccc(OCCO)cc3)[nH]c(=O)c12