Reaction Details
TargetCyclin-A2/Cyclin-dependent kinase 2
LigandBDBM8066
Substrate/Competitorn/a
Meas. Tech.In Vitro Inhibition
IC50 2.2e+2±n/a nM
Citation Kontopidis, GMcInnes, CPandalaneni, SRMcNae, IGibson, DMezna, MThomas, MWood, GWang, SWalkinshaw, MDFischer, PM Differential binding of inhibitors to active and inactive CDK2 provides insights for drug design. Chem Biol13:201-11 (2006) 
 
Cyclin-A2/Cyclin-dependent kinase 2
Name:Cyclin-A2/Cyclin-dependent kinase 2
Type:Protein Complex
Mol. Mass.:n/a
Description:Cdk2/Cyclin A kinase was purified from insect cells coinfected with Cyclin A/Cdk2 baculovirus.
Components:This complex has 2 components.
Component 1
Name:Cyclin-dependent kinase 2
Synonyms:CDK2 CDK2_HUMAN Cell division protein kinase 2 Protein cereblon/Cyclin-dependent kinase 2 | p33 protein kinase
Type:Enzyme Subunit
Mol. Mass.:33938.17
Organism:Homo sapiens (Human)
Description:P24941
Residue:298
Component 2
Name:Cyclin-A2
Synonyms:CCN1 CCNA1 CCNA2_HUMAN Cyclin-A
Type:Enzyme Subunit
Mol. Mass.:48550.19
Organism:Homo sapiens (Human)
Description:P20248
Residue:432
BDBM8066
NameBDBM8066
Synonyms:2-Anilino-4-(thiazol-5-yl)pyrimidine deriv. 37 4-N-[4-(2,4-dimethyl-1,3-thiazol-5-yl)pyrimidin-2-yl]-1-N,1-N-dimethylbenzene-1,4-diamine | N-[4-(2,4-Dimethylthiazol-5-yl)pyrimidin-2-yl]N,N-dimethylbenzene-1,4-diamine
TypeSmall organic molecule
Emp. Form.C17H19N5S
Mol. Mass.325.431
SMILESCN(C)c1ccc(Nc2nccc(n2)-c2sc(C)nc2C)cc1