Reaction Details
TargetReplicase polyprotein 1ab
LigandBDBM59237
Substrate/Competitorn/a
Meas. Tech.Inhibition Assay
pH7.5±0
Ki 19.5±0.0 nM
Citation Wu, CYKing, KYKuo, CJFang, JMWu, YTHo, MYLiao, CLShie, JJLiang, PHWong, CH Stable benzotriazole esters as mechanism-based inactivators of the severe acute respiratory syndrome 3CL protease. Chem Biol13:261-8 (2006) 
 
Replicase polyprotein 1ab
Name:Replicase polyprotein 1ab
Type:Protein
Mol. Mass.:790250.81
Organism:Human SARS coronavirus (SARS-CoV) (Severe acute respiratory syndrome coronavirus)
Description:P0C6X7
Residue:7073
BDBM59237
NameBDBM59237
Synonyms:Benzotriazole ester, 3 med.21724, Compound 88
TypeSmall organic molecule
Emp. Form.C13H10N4O2
Mol. Mass.254.2441
SMILESNc1ccccc1C(=O)On1nnc2ccccc12