Reaction Details
TargetReplicase polyprotein 1ab
LigandBDBM59238
Substrate/Competitorn/a
Meas. Tech.Inhibition Assay
pH7.5±0
Ki 17.4±0.0 nM
Citation Wu, CYKing, KYKuo, CJFang, JMWu, YTHo, MYLiao, CLShie, JJLiang, PHWong, CH Stable benzotriazole esters as mechanism-based inactivators of the severe acute respiratory syndrome 3CL protease. Chem Biol13:261-8 (2006) 
 
Replicase polyprotein 1ab
Name:Replicase polyprotein 1ab
Type:Protein
Mol. Mass.:790250.81
Organism:Human SARS coronavirus (SARS-CoV) (Severe acute respiratory syndrome coronavirus)
Description:P0C6X7
Residue:7073
BDBM59238
NameBDBM59238
Synonyms:Benzotriazole ester, 4 med.21724, Compound 89
TypeSmall organic molecule
Emp. Form.C15H14N4O2
Mol. Mass.282.2973
SMILESCN(C)c1ccc(cc1)C(=O)On1nnc2ccccc12