Reaction Details
TargetReplicase polyprotein 1ab
LigandBDBM59249
Substrate/Competitorn/a
Meas. Tech.Inhibition Assay
pH7.5±0
Ki 4.5e+3±n/a nM
Citation Wu, CYKing, KYKuo, CJFang, JMWu, YTHo, MYLiao, CLShie, JJLiang, PHWong, CH Stable benzotriazole esters as mechanism-based inactivators of the severe acute respiratory syndrome 3CL protease. Chem Biol13:261-8 (2006) 
 
Replicase polyprotein 1ab
Name:Replicase polyprotein 1ab
Type:Protein
Mol. Mass.:790250.81
Organism:Human SARS coronavirus (SARS-CoV) (Severe acute respiratory syndrome coronavirus)
Description:P0C6X7
Residue:7073
BDBM59249
NameBDBM59249
Synonyms:Benzotriazole ester, 17 | acs.jmedchem.1c00409_ST.362
TypeSmall organic molecule
Emp. Form.C15H14N4O
Mol. Mass.266.2979
SMILESCNc1ccc(cc1)C(=O)Cn1nnc2ccccc12