Reaction Details
TargetReplicase polyprotein 1ab
LigandBDBM59251
Substrate/Competitorn/a
Meas. Tech.Inhibition Assay
pH7.5±0
Ki>5.0e+4±n/a nM
Citation Wu, CYKing, KYKuo, CJFang, JMWu, YTHo, MYLiao, CLShie, JJLiang, PHWong, CH Stable benzotriazole esters as mechanism-based inactivators of the severe acute respiratory syndrome 3CL protease. Chem Biol13:261-8 (2006) 
 
Replicase polyprotein 1ab
Name:Replicase polyprotein 1ab
Type:Protein
Mol. Mass.:790250.81
Organism:Human SARS coronavirus (SARS-CoV) (Severe acute respiratory syndrome coronavirus)
Description:P0C6X7
Residue:7073
BDBM59251
NameBDBM59251
Synonyms:Benzotriazole ester, 19
TypeSmall organic molecule
Emp. Form.C15H16N4O
Mol. Mass.268.3137
SMILESCNc1ccc(cc1)C(O)Cn1nnc2ccccc12