Reaction Details
TargetAlkaline phosphatase, germ cell type
LigandBDBM39617
Substrate/Competitorn/a
Meas. Tech.Luminescent assay for HTS discovery of chemical activators of placental alkaline phosphatase
EC50 999000±n/a nM
Citation PubChem, PC Luminescent assay for HTS discovery of chemical activators of placental alkaline phosphatase PubChem Bioassay(2007)[AID]
 
Alkaline phosphatase, germ cell type
Name:Alkaline phosphatase, germ cell type
Type:PROTEIN
Mol. Mass.:57374.31
Organism:Homo sapiens (Human)
Description:ChEMBL_29964
Residue:532
BDBM39617
NameBDBM39617
Synonyms:3-[5-(methylamino)-1,3,4-thiadiazol-2-yl]-1-benzopyran-2-one 3-[5-(methylamino)-1,3,4-thiadiazol-2-yl]chromen-2-one MLS000094728 cid_3244772
TypeSmall organic molecule
Emp. Form.C12H9N3O2S
Mol. Mass.259.284
SMILESCNc1nnc(s1)-c1cc2ccccc2oc1=O