Reaction Details
TargetAlkaline phosphatase, germ cell type
LigandBDBM39693
Substrate/Competitorn/a
Meas. Tech.Luminescent assay for HTS discovery of chemical activators of placental alkaline phosphatase
EC50 999000±n/a nM
Citation PubChem, PC Luminescent assay for HTS discovery of chemical activators of placental alkaline phosphatase PubChem Bioassay(2007)[AID]
 
Alkaline phosphatase, germ cell type
Name:Alkaline phosphatase, germ cell type
Type:PROTEIN
Mol. Mass.:57374.31
Organism:Homo sapiens (Human)
Description:ChEMBL_29964
Residue:532
BDBM39693
NameBDBM39693
Synonyms:1-[2-(diethylamino)ethyl]-N-[[1-(phenylmethyl)-2-benzimidazolyl]methyl]-2-benzimidazolamine 2-[2-[(1-benzylbenzimidazol-2-yl)methylamino]benzimidazol-1-yl]ethyl-diethyl-amine N-[(1-benzyl-1H-benzimidazol-2-yl)methyl]-1-[2-(diethylamino)ethyl]-1H-benzimidazol-2-amine SMR000140572 | cid_1253120
TypeSmall organic molecule
Emp. Form.C28H32N6
Mol. Mass.452.5939
SMILESCCN(CC)CCn1c(NCc2nc3ccccc3n2Cc2ccccc2)nc2ccccc12