Reaction Details
TargetM17 leucyl aminopeptidase
LigandBDBM59649
Substrate/Competitorn/a
Meas. Tech.Inhibitors of Plasmodium falciparum M17- Family Leucine Aminopeptidase (M17LAP)
IC50 1000±n/a nM
Citation PubChem, PC Inhibitors of Plasmodium falciparum M17- Family Leucine Aminopeptidase (M17LAP) PubChem Bioassay(2009)[AID]
 
M17 leucyl aminopeptidase
Name:M17 leucyl aminopeptidase
Synonyms:leucine aminopeptidase
Type:Enzyme Catalytic Domain
Mol. Mass.:67834.32
Organism:Plasmodium falciparum 3D7
Description:gi_124809582
Residue:605
BDBM59649
NameBDBM59649
TypeSmall organic molecule
Emp. Form.C21H20N4O5S
Mol. Mass.440.472
SMILESCn1c(SCC(=O)NCc2ccc3OCOc3c2)nnc1C1COc2ccccc2O1