Reaction Details
TargetM17 leucyl aminopeptidase
LigandBDBM59662
Substrate/Competitorn/a
Meas. Tech.Inhibitors of Plasmodium falciparum M17- Family Leucine Aminopeptidase (M17LAP)
IC50 1000±n/a nM
Citation PubChem, PC Inhibitors of Plasmodium falciparum M17- Family Leucine Aminopeptidase (M17LAP) PubChem Bioassay(2009)[AID]
 
M17 leucyl aminopeptidase
Name:M17 leucyl aminopeptidase
Synonyms:leucine aminopeptidase
Type:Enzyme Catalytic Domain
Mol. Mass.:67834.32
Organism:Plasmodium falciparum 3D7
Description:gi_124809582
Residue:605
BDBM59662
NameBDBM59662
TypeSmall organic molecule
Emp. Form.C9H7ClN2O
Mol. Mass.194.618
SMILESClc1ccc(cc1)-c1cc(=O)[nH][nH]1