Reaction Details
TargetM17 leucyl aminopeptidase
LigandBDBM33090
Substrate/Competitorn/a
Meas. Tech.Inhibitors of Plasmodium falciparum M17- Family Leucine Aminopeptidase (M17LAP)
IC50 82270±n/a nM
Citation PubChem, PC Inhibitors of Plasmodium falciparum M17- Family Leucine Aminopeptidase (M17LAP) PubChem Bioassay(2009)[AID]
 
M17 leucyl aminopeptidase
Name:M17 leucyl aminopeptidase
Synonyms:leucine aminopeptidase
Type:Enzyme Catalytic Domain
Mol. Mass.:67834.32
Organism:Plasmodium falciparum 3D7
Description:gi_124809582
Residue:605
BDBM33090
NameBDBM33090
TypeSmall organic molecule
Emp. Form.C13H15N3O3S
Mol. Mass.293.342
SMILESCCN=c1scc(C)n1N=Cc1ccc(O)c(O)c1O