Reaction Details
TargetM17 leucyl aminopeptidase
LigandBDBM60016
Substrate/Competitorn/a
Meas. Tech.Inhibitors of Plasmodium falciparum M17- Family Leucine Aminopeptidase (M17LAP)
IC50 1000±n/a nM
Citation PubChem, PC Inhibitors of Plasmodium falciparum M17- Family Leucine Aminopeptidase (M17LAP) PubChem Bioassay(2009)[AID]
 
M17 leucyl aminopeptidase
Name:M17 leucyl aminopeptidase
Synonyms:leucine aminopeptidase
Type:Enzyme Catalytic Domain
Mol. Mass.:67834.32
Organism:Plasmodium falciparum 3D7
Description:gi_124809582
Residue:605
BDBM60016
NameBDBM60016
TypeSmall organic molecule
Emp. Form.C19H15N3O4S
Mol. Mass.381.405
SMILESCOc1cccc(NC(=O)CSc2nc3c4ccccc4oc3c(=O)[nH]2)c1