Reaction Details
TargetM17 leucyl aminopeptidase
LigandBDBM60035
Substrate/Competitorn/a
Meas. Tech.Inhibitors of Plasmodium falciparum M17- Family Leucine Aminopeptidase (M17LAP)
IC50 1000±n/a nM
Citation PubChem, PC Inhibitors of Plasmodium falciparum M17- Family Leucine Aminopeptidase (M17LAP) PubChem Bioassay(2009)[AID]
 
M17 leucyl aminopeptidase
Name:M17 leucyl aminopeptidase
Synonyms:leucine aminopeptidase
Type:Enzyme Catalytic Domain
Mol. Mass.:67834.32
Organism:Plasmodium falciparum 3D7
Description:gi_124809582
Residue:605
BDBM60035
NameBDBM60035
TypeSmall organic molecule
Emp. Form.C18H20N6O3S2
Mol. Mass.432.52
SMILESO=C(CSc1nnc(Nc2ccccc2)s1)NN1C(=O)NC2(CCCCC2)C1=O