Reaction Details
TargetM17 leucyl aminopeptidase
LigandBDBM60091
Substrate/Competitorn/a
Meas. Tech.Inhibitors of Plasmodium falciparum M17- Family Leucine Aminopeptidase (M17LAP)
IC50 1000±n/a nM
Citation PubChem, PC Inhibitors of Plasmodium falciparum M17- Family Leucine Aminopeptidase (M17LAP) PubChem Bioassay(2009)[AID]
 
M17 leucyl aminopeptidase
Name:M17 leucyl aminopeptidase
Synonyms:leucine aminopeptidase
Type:Enzyme Catalytic Domain
Mol. Mass.:67834.32
Organism:Plasmodium falciparum 3D7
Description:gi_124809582
Residue:605
BDBM60091
NameBDBM60091
TypeSmall organic molecule
Emp. Form.C14H11ClN2O3
Mol. Mass.290.702
SMILESOC(=O)c1cccc(NC(=O)Nc2ccc(Cl)cc2)c1