Reaction Details
TargetM17 leucyl aminopeptidase
LigandBDBM60104
Substrate/Competitorn/a
Meas. Tech.Inhibitors of Plasmodium falciparum M17- Family Leucine Aminopeptidase (M17LAP)
IC50 1490±n/a nM
Citation PubChem, PC Inhibitors of Plasmodium falciparum M17- Family Leucine Aminopeptidase (M17LAP) PubChem Bioassay(2009)[AID]
 
M17 leucyl aminopeptidase
Name:M17 leucyl aminopeptidase
Synonyms:leucine aminopeptidase
Type:Enzyme Catalytic Domain
Mol. Mass.:67834.32
Organism:Plasmodium falciparum 3D7
Description:gi_124809582
Residue:605
BDBM60104
NameBDBM60104
TypeSmall organic molecule
Emp. Form.C19H25NO5S
Mol. Mass.379.471
SMILESCOC(=O)c1c(NC(=O)C2CCCCC2C(O)=O)sc2CCCCCc12