Reaction Details
TargetM17 leucyl aminopeptidase
LigandBDBM60105
Substrate/Competitorn/a
Meas. Tech.Inhibitors of Plasmodium falciparum M17- Family Leucine Aminopeptidase (M17LAP)
IC50 1000±n/a nM
Citation PubChem, PC Inhibitors of Plasmodium falciparum M17- Family Leucine Aminopeptidase (M17LAP) PubChem Bioassay(2009)[AID]
 
M17 leucyl aminopeptidase
Name:M17 leucyl aminopeptidase
Synonyms:leucine aminopeptidase
Type:Enzyme Catalytic Domain
Mol. Mass.:67834.32
Organism:Plasmodium falciparum 3D7
Description:gi_124809582
Residue:605
BDBM60105
NameBDBM60105
TypeSmall organic molecule
Emp. Form.C22H23NO5S
Mol. Mass.413.487
SMILESCOC(=O)c1c(NC(=O)C2CC=CCC2C(O)=O)scc1-c1cc(C)ccc1C