Reaction Details
TargetM17 leucyl aminopeptidase
LigandBDBM60123
Substrate/Competitorn/a
Meas. Tech.Inhibitors of Plasmodium falciparum M17- Family Leucine Aminopeptidase (M17LAP)
IC50 1390±n/a nM
Citation PubChem, PC Inhibitors of Plasmodium falciparum M17- Family Leucine Aminopeptidase (M17LAP) PubChem Bioassay(2009)[AID]
 
M17 leucyl aminopeptidase
Name:M17 leucyl aminopeptidase
Synonyms:leucine aminopeptidase
Type:Enzyme Catalytic Domain
Mol. Mass.:67834.32
Organism:Plasmodium falciparum 3D7
Description:gi_124809582
Residue:605
BDBM60123
NameBDBM60123
TypeSmall organic molecule
Emp. Form.C19H20N2O3S
Mol. Mass.356.439
SMILES[H]C12CC([H])(C=C1)C(C2C(O)=O)C(=O)Nc1sc2CCCCCc2c1C#N