Reaction Details
TargetDual specificity protein phosphatase 3
LigandBDBM34452
Substrate/Competitorn/a
Meas. Tech.uHTS absorbance assay for the identification of compounds that inhibit VHR1.
IC50 1270±n/a nM
Citation PubChem, PC uHTS absorbance assay for the identification of compounds that inhibit VHR1. PubChem Bioassay(2009)[AID]
 
Dual specificity protein phosphatase 3
Name:Dual specificity protein phosphatase 3
Type:Hydrolase
Mol. Mass.:20480.58
Organism:Homo sapiens (Human)
Description:n/a
Residue:185
BDBM34452
NameBDBM34452
Synonyms:(4-amino-3-phenyl-2-sulfanylidene-1,3-thiazol-5-yl)-(4-methylpiperazin-1-yl)methanone (4-amino-3-phenyl-2-thioxo-4-thiazolin-5-yl)-(4-methylpiperazino)methanone 4-amino-5-[(4-methyl-1-piperazinyl)carbonyl]-3-phenyl-1,3-thiazole-2(3H)-thione SMR000072313 | cid_889170
TypeSmall organic molecule
Emp. Form.C15H18N4OS2
Mol. Mass.334.46
SMILESCN1CCN(CC1)C(=O)c1sc(=S)n(c1N)-c1ccccc1